BDBM211169 US9247759, 5-115
SMILES CCOC(=O)C1CCC(CN(Cc2ccccc2)S(=O)(=O)c2ccc(NC(C)=O)cc2)CC1
InChI Key InChIKey=IEYJOURQJADKKJ-UHFFFAOYSA-N
Data  1 IC50
  Tab Delimited (TSV)   2D SDfile   Computed 3D by Vconf -m prep SDfile
Find this compound or compounds like it in BindingDB:
Activity Spreadsheet -- Enzyme Inhibition Constant Data from BindingDB
Found 1 hit for monomerid = 211169
TargetTaste receptor type 2 member 14(Homo sapiens (Human))
Senomyx
US Patent
LigandPNGBDBM211169(US9247759, 5-115)
Affinity DataIC50:  334nM. Assay description: In another embodiment, Fluorescence Polarization ("FP") based assays may be used to detect and monitor ligand binding. Fluorescence polarization is a...
In DepthDetails US Patent