BDBM211502 US9290457, Example 1.44
SMILES CN(C)CCN(C)C(=O)c1cc(ccc1C1N(C)C(=O)N(C(C)=C1C(C)=O)c1cccc(c1)C(F)(F)F)C#N
InChI Key InChIKey=JQKZLVQMJVOGGD-UHFFFAOYSA-N
Data  1 IC50
  Tab Delimited (TSV)   2D SDfile   Computed 3D by Vconf -m prep SDfile
Find this compound or compounds like it in BindingDB:
Activity Spreadsheet -- Enzyme Inhibition Constant Data from BindingDB
Found 1 hit for monomerid = 211502
TargetNeutrophil elastase(Homo sapiens (Human))
Boehringer Ingelheim International
US Patent
LigandPNGBDBM211502(US9290457, Example 1.44)
Affinity DataIC50: <1nMpH: 7.5 T: 2°C. Assay description: Materials: Human neutrophil elastase was purchased from Calbiochem (Cat. No.: 324681) and the elastase substrate MeOSuc-Ala-Ala-Pro-Val-AMC from Bach...
Ligand InfoPC cidPC sid
In DepthDetails US Patent