BDBM211879 US9290459, 44::US9670166, 44
SMILES FC(F)(F)c1cccc(c1)N1C2=C(C(N(C(=O)NC3CCS(=N)(=O)CC3)C1=O)c1ccc(cc1)C#N)C(=O)CC2
InChI Key InChIKey=VMQIRBGUBHIXAU-UHFFFAOYSA-N
Data  2 IC50
  Tab Delimited (TSV)   2D SDfile   Computed 3D by Vconf -m prep SDfile
Find this compound or compounds like it in BindingDB:
Activity Spreadsheet -- Enzyme Inhibition Constant Data from BindingDB
Found 2 hits for monomerid = 211879
TargetNeutrophil elastase(Homo sapiens (Human))
Boehringer Ingelheim International
US Patent
LigandPNGBDBM211879(US9290459, 44 | US9670166, 44)
Affinity DataIC50: <1nMpH: 7.5 T: 2°C. Assay description: Materials: Human neutrophil elastase was purchased from Calbiochem (Cat. No.: 324681) and the elastase substrate MeOSuc-Ala-Ala-Pro-Val-AMC from Bach...
Ligand InfoPC cidPC sid
In DepthDetails US Patent
TargetNeutrophil elastase(Homo sapiens (Human))
Boehringer Ingelheim International
US Patent
LigandPNGBDBM211879(US9290459, 44 | US9670166, 44)
Affinity DataIC50: <1nMpH: 7.5 T: 2°C. Assay description: Materials: Human neutrophil elastase was purchased from Calbiochem (Cat. No.: 324681) and the elastase substrate MeOSuc-Ala-Ala-Pro-Val-AMC from Bach...
Ligand InfoPC cidPC sid
In DepthDetails US Patent