BDBM211916 US9290459, 49.3::US9670166, 49.3
SMILES CS(=O)(=O)CCNC(=O)N1C(C2=C(CCC2=O)N(C1=O)c1cccc(c1)C(F)(F)F)c1ccc(cc1F)C#N
InChI Key InChIKey=SQOLSFKLZNUHBF-UHFFFAOYSA-N
Data  2 IC50  1 EC50
  Tab Delimited (TSV)   2D SDfile   Computed 3D by Vconf -m prep SDfile
Find this compound or compounds like it in BindingDB:
Activity Spreadsheet -- Enzyme Inhibition Constant Data from BindingDB
Found 3 hits for monomerid = 211916
TargetNeutrophil elastase(Homo sapiens (Human))
Boehringer Ingelheim International
US Patent
LigandPNGBDBM211916(US9290459, 49.3 | US9670166, 49.3)
Affinity DataEC50:  7nMpH: 7.5Assay Description:Various concentrations of the neutrophil elastase inhibitor are incubated with plasma. Subsequently, the enzyme activity is measured using the fluoro...
Ligand InfoPC cidPC sid
In DepthDetails US Patent
TargetNeutrophil elastase(Homo sapiens (Human))
Boehringer Ingelheim International
US Patent
LigandPNGBDBM211916(US9290459, 49.3 | US9670166, 49.3)
Affinity DataIC50:  1nMpH: 7.5 T: 2°C. Assay description: Materials: Human neutrophil elastase was purchased from Calbiochem (Cat. No.: 324681) and the elastase substrate MeOSuc-Ala-Ala-Pro-Val-AMC from Bach...
Ligand InfoPC cidPC sid
In DepthDetails US Patent
TargetNeutrophil elastase(Homo sapiens (Human))
Boehringer Ingelheim International
US Patent
LigandPNGBDBM211916(US9290459, 49.3 | US9670166, 49.3)
Affinity DataIC50:  1nMpH: 7.5 T: 2°C. Assay description: Materials: Human neutrophil elastase was purchased from Calbiochem (Cat. No.: 324681) and the elastase substrate MeOSuc-Ala-Ala-Pro-Val-AMC from Bach...
Ligand InfoPC cidPC sid
In DepthDetails US Patent