BDBM211968 US9290482, 8
SMILES COc1nccc2oc(cc12)-c1cnc2ccc(OCC3CCCCN3)nn12
InChI Key InChIKey=WFGGSCDJNHNYQI-UHFFFAOYSA-N
Data  1 IC50
  Tab Delimited (TSV)   2D SDfile   Computed 3D by Vconf -m prep SDfile
Find this compound or compounds like it in BindingDB:
Activity Spreadsheet -- Enzyme Inhibition Constant Data from BindingDB
Found 1 hit for monomerid = 211968
TargetIsoform 2 of MAP kinase-interacting serine/threonine-protein kinase 1 (MNK1a) 344D](Homo sapiens (Human))
Bayer Pharma Aktiengesellschaft
US Patent
LigandPNGBDBM211968(US9290482, 8)
Affinity DataIC50:  48nMpH: 7.5 T: 2°C. Assay description: For the assay 50 nl nL of a 100fold concentrated solution of the test compound in DMSO was pipetted into a black low volume 384well microtiter plate ...
Ligand InfoPC cidPC sid
In DepthDetails US Patent