BDBM212251 US9550778, chem-us-00207
SMILES Cc1csc(NC(=O)c2cc(cn3ncnc23)-c2cc(C)cc(C)c2)n1
InChI Key InChIKey=HJYDDJSWZOUOFK-UHFFFAOYSA-N
Data  1 IC50
  Tab Delimited (TSV)   2D SDfile   Computed 3D by Vconf -m prep SDfile
Find this compound or compounds like it in BindingDB:
Activity Spreadsheet -- Enzyme Inhibition Constant Data from BindingDB
Found 1 hit for monomerid = 212251
TargetMetabotropic glutamate receptor 5(Rattus norvegicus (Rat))
Vanderbilt University
US Patent
LigandPNGBDBM212251(US9550778, chem-us-00207)
Affinity DataIC50: >10nMpH: 7.4 T: 2°C. Assay description: The following examples of the in vitro effects of the disclosed compounds are prophetic. An example of an in vitro assay method for assessing the rec...
Ligand InfoPC cidPC sid
In DepthDetails US Patent