BDBM212441 US8772490, TAZ
SMILES CC1(Cn2ccnn2)[C@H](N2C(CC2=O)S1(=O)=O)C(=O)O[Na]
InChI Key InChIKey=RFMIKMMOLPNEDG-KSDDPMCLSA-M
Data  1 IC50
  Tab Delimited (TSV)   2D SDfile   Computed 3D by Vconf -m prep SDfile
Find this compound or compounds like it in BindingDB:
Activity Spreadsheet -- Enzyme Inhibition Constant Data from BindingDB
Found 1 hit for monomerid = 212441
TargetBeta-lactamase(Pseudomonas aeruginosa (PAO1))
Meiji Seika Pharma
US Patent
LigandPNGBDBM212441(US8772490, TAZ)
Affinity DataIC50:  950nMpH: 7.0 T: 2°C. Assay description: For the measurement of β-lactamase inhibitory activity, 100 uM (final concentration) nitrocefin (Oxoid) was used as a substrate, and 2.5% DMSO, ...
Ligand InfoPC cidPC sid
In DepthDetails US Patent