BDBM212448 US9278918, 34
SMILES OC(=O)C1(CC1)NC(=O)Nc1cc(Cl)ccc1-c1ccccc1
InChI Key InChIKey=FMQBUMLPTSUNJJ-UHFFFAOYSA-N
Data  2 IC50
  Tab Delimited (TSV)   2D SDfile   Computed 3D by Vconf -m prep SDfile
Find this compound or compounds like it in BindingDB:
Activity Spreadsheet -- Enzyme Inhibition Constant Data from BindingDB
Found 2 hits for monomerid = 212448
TargetFatty acid-binding protein 5(Homo sapiens (Human))
Hoffmann-La Roche
US Patent
LigandPNGBDBM212448(US9278918, 34)
Affinity DataIC50: >5.00E+4nMpH: 7.5 T: 2°C. Assay description: Stock DMSO solutions (1.8 mM) of compounds were serially diluted 3-fold for ten concentrations with 100% DMSO (50 uM to 0.003 uM final compound conce...
Ligand InfoPC cidPC sid
In DepthDetails US Patent
TargetFatty acid-binding protein, adipocyte(Homo sapiens (Human))
Hoffmann-La Roche
US Patent
LigandPNGBDBM212448(US9278918, 34)
Affinity DataIC50:  140nMpH: 7.5 T: 2°C. Assay description: Stock DMSO solutions (1.8 mM) of compounds were serially diluted 3-fold for ten concentrations with 100% DMSO (50 uM to 0.003 uM final compound conce...
Ligand InfoPC cidPC sid
In DepthDetails US Patent