BDBM212489 US10155731, Example 43::US9278944, 43
SMILES COCCCOc1cc(cc2occc12)[C@@H](C)N(C1CC1)C(=O)[C@H]1CNCCO1
InChI Key InChIKey=RNDPRUVTGHOKOT-QVKFZJNVSA-N
Data  2 IC50
  Tab Delimited (TSV)   2D SDfile   Computed 3D by Vconf -m prep SDfile
Find this compound or compounds like it in BindingDB:
Activity Spreadsheet -- Enzyme Inhibition Constant Data from BindingDB
Found 2 hits for monomerid = 212489
TargetRenin(Homo sapiens (Human))
Mitsubishi Tanabe Pharma
US Patent
LigandPNGBDBM212489(US10155731, Example 43 | US9278944, 43)
Affinity DataIC50:  1.60nM. Assay description: A substrate of synthetic peptide (Nma-KHPFH LVIHK(Dnp)-NH2) and test compound were mixed, and fluorescence intensity was assayed using a fluorophotom...
Ligand InfoPC cidPC sid
In DepthDetails US Patent
TargetRenin(Homo sapiens (Human))
Mitsubishi Tanabe Pharma
US Patent
LigandPNGBDBM212489(US10155731, Example 43 | US9278944, 43)
Affinity DataIC50:  1.60nM. Assay description: A substrate of synthetic peptide (Nma-KHPFHLVIHK(Dnp)-NH2) and test compound were mixed, and fluorescence intensity was assayed using a fluorophotome...
Ligand InfoPC cidPC sid
In DepthDetails US Patent