BDBM212592 US9556111, Table 1.1::US9951033, Compound Table 1.1
SMILES CC(C)(C)c1ccc(CN(Cc2nc(cs2)C(O)=O)Cc2ccc(F)cc2)cc1
InChI Key InChIKey=CJGWWGSNPCVSNO-UHFFFAOYSA-N
Data  2 EC50
  Tab Delimited (TSV)   2D SDfile   Computed 3D by Vconf -m prep SDfile
Find this compound or compounds like it in BindingDB:
Activity Spreadsheet -- Enzyme Inhibition Constant Data from BindingDB
Found 2 hits for monomerid = 212592
TargetA-kinase anchor protein 7 isoform gamma(Mus musculus (Mouse))
Universitetet I Oslo
US Patent
LigandPNGBDBM212592(US9556111, Table 1.1 | US9951033, Compound Table 1...)
Affinity DataEC50:  4.16E+4nM. Assay description: Stable and optimal assay conditions were determined by cross-titrating GST-AKAP18 δ and biotinylated PLB using 10 μg/ml glutathione accepto...
Ligand InfoPC cidPC sid
In DepthDetails US Patent
TargetA-kinase anchor protein 7 isoform gamma(Homo sapiens (Human))
Universitetet I Oslo
US Patent
LigandPNGBDBM212592(US9556111, Table 1.1 | US9951033, Compound Table 1...)
Affinity DataEC50:  4.16E+4nM. Assay description: Stable and optimal assay conditions were determined by cross-titrating GST-AKAP18δ and biotinylated PLB using 10 μg/ml glutathione acceptor...
Ligand InfoPC cidPC sid
In DepthDetails US Patent