BDBM212956 US9278960, 4-40::US9663506, Example 4-40
SMILES NC(=O)c1cc(-c2ccc(F)cc2)c2ccc(CN3CCC(O)CC3)cc2n1
InChI Key InChIKey=JFCCAFNVHKWPOI-UHFFFAOYSA-N
Data  3 IC50
  Tab Delimited (TSV)   2D SDfile   Computed 3D by Vconf -m prep SDfile
Find this compound or compounds like it in BindingDB:
Activity Spreadsheet -- Enzyme Inhibition Constant Data from BindingDB
Found 3 hits for monomerid = 212956
LigandPNGBDBM212956(US9278960, 4-40 | US9663506, Example 4-40)
Affinity DataIC50:  392nM. Assay description: The utility of the compounds in accordance with the present invention as antagonists of metabotropic glutamate receptor activity, in particular mGluR...
Ligand InfoPC cidPC sid
In DepthDetails US Patent
TargetMetabotropic glutamate receptor 2(Homo sapiens (Human))
Merck Sharp & Dohme
US Patent
LigandPNGBDBM212956(US9278960, 4-40 | US9663506, Example 4-40)
Affinity DataIC50:  392nM. Assay description: The utility of the compounds in accordance with the present invention as antagonists of metabotropic glutamate receptor activity, in particular mGluR...
Ligand InfoPC cidPC sid
In DepthDetails US Patent
TargetMetabotropic glutamate receptor 2(Homo sapiens (Human))
Merck Sharp & Dohme
US Patent
LigandPNGBDBM212956(US9278960, 4-40 | US9663506, Example 4-40)
Affinity DataIC50:  392nM. Assay description: The utility of the compounds in accordance with the present invention as antagonists of metabotropic glutamate receptor activity, in particular mGluR...
Ligand InfoPC cidPC sid
In DepthDetails US Patent