BDBM213167 US9278963, 014
SMILES ONC(=O)c1cnc(NC2(CCN(CC2)C(=O)Nc2ccc(F)cc2)c2ccccc2)nc1
InChI Key InChIKey=OTLJTZYWUNDMTL-UHFFFAOYSA-N
Data  4 IC50
  Tab Delimited (TSV)   2D SDfile   Computed 3D by Vconf -m prep SDfile
Find this compound or compounds like it in BindingDB:
Activity Spreadsheet -- Enzyme Inhibition Constant Data from BindingDB
Found 4 hits for monomerid = 213167
TargetHistone deacetylase 1(Homo sapiens (Human))
Acetylon Pharmaceuticals
US Patent
LigandPNGBDBM213167(US9278963, 014)
Affinity DataIC50:  33nMpH: 7.4 T: 2°C. Assay description: The compounds were diluted in assay buffer (50 mM HEPES, pH 7.4, 100 mM KCl, 0.001% Tween-20, 0.05% BSA, 20 uM TCEP) to 6 fold their final concentrat...
Ligand InfoPC cidPC sid
In DepthDetails US Patent
TargetHistone deacetylase 6(Homo sapiens (Human))
Acetylon Pharmaceuticals
US Patent
LigandPNGBDBM213167(US9278963, 014)
Affinity DataIC50:  2nMpH: 7.4 T: 2°C. Assay description: The compounds were diluted in assay buffer (50 mM HEPES, pH 7.4, 100 mM KCl, 0.001% Tween-20, 0.05% BSA, 20 uM TCEP) to 6 fold their final concentrat...
Ligand InfoPC cidPC sid
In DepthDetails US Patent
TargetHistone deacetylase 3(Homo sapiens (Human))
Acetylon Pharmaceuticals
US Patent
LigandPNGBDBM213167(US9278963, 014)
Affinity DataIC50:  1.07E+3nMpH: 7.4 T: 2°C. Assay description: The compounds were diluted in assay buffer (50 mM HEPES, pH 7.4, 100 mM KCl, 0.001% Tween-20, 0.05% BSA, 20 uM TCEP) to 6 fold their final concentrat...
Ligand InfoPC cidPC sid
In DepthDetails US Patent
TargetHistone deacetylase 2(Homo sapiens (Human))
Acetylon Pharmaceuticals
US Patent
LigandPNGBDBM213167(US9278963, 014)
Affinity DataIC50:  43nMpH: 7.4 T: 2°C. Assay description: The compounds were diluted in assay buffer (50 mM HEPES, pH 7.4, 100 mM KCl, 0.001% Tween-20, 0.05% BSA, 20 uM TCEP) to 6 fold their final concentrat...
Ligand InfoPC cidPC sid
In DepthDetails US Patent