BDBM213626 US9278981, 218
SMILES O[C@@H]1CCN(C1)c1ncc(cc1-c1cncc(F)c1)C(=O)Nc1ccc(SC(F)(F)Cl)cc1
InChI Key InChIKey=XDWCEJMZRFFPOS-QGZVFWFLSA-N
Data  4 IC50
  Tab Delimited (TSV)   2D SDfile   Computed 3D by Vconf -m prep SDfile
Find this compound or compounds like it in BindingDB:
Activity Spreadsheet -- Enzyme Inhibition Constant Data from BindingDB
Found 4 hits for monomerid = 213626
TargetTyrosine-protein kinase ABL1 [64-515](Homo sapiens (Human))
Novartis
US Patent
LigandPNGBDBM213626(US9278981, 218)
Affinity DataIC50:  3nMpH: 7.5 T: 2°C. Assay description: For determination of ABL kinase activity, the radiometric filter-binding assay was used. The assay was performed by mixing 10 uL of the compound pre-...
Ligand InfoPC cidPC sid
In DepthDetails US Patent
TargetTyrosine-protein kinase ABL1(Homo sapiens (Human))
Novartis
US Patent
LigandPNGBDBM213626(US9278981, 218)
Affinity DataIC50:  10nM. Assay description: Test compounds were resuspended in DMSO at a concentration of 10 mM. A serial three-fold dilution of each compound with DMSO was performed in 384-wel...
Ligand InfoPC cidPC sid
In DepthDetails US Patent
TargetTyrosine-protein kinase ABL1(Homo sapiens (Human))
Novartis
US Patent
LigandPNGBDBM213626(US9278981, 218)
Affinity DataIC50:  0.900nM. Assay description: Test compounds were resuspended in DMSO at a concentration of 10 mM. A serial three-fold dilution of each compound with DMSO was performed in 384-wel...
Ligand InfoPC cidPC sid
In DepthDetails US Patent
TargetTyrosine-protein kinase ABL1 [64-515](Homo sapiens (Human))
Novartis
US Patent
LigandPNGBDBM213626(US9278981, 218)
Affinity DataIC50:  0.600nMpH: 7.5 T: 2°C. Assay description: The assay plates were prepared by addition of 50 nL per well of compound solution in 90% DMSO. The kinase reactions were started by stepwise addition...
Ligand InfoPC cidPC sid
In DepthDetails US Patent