BDBM213795 US9284317, 1-7
SMILES C\C=C(/C)c1cn2c(cnc2c(NCC(C)C)n1)-c1ccc(cc1)C(=O)NC1CC1
InChI Key InChIKey=IPZIWQBJPCWXFW-FZSIALSZSA-N
Data  1 IC50
  Tab Delimited (TSV)   2D SDfile   Computed 3D by Vconf -m prep SDfile
Find this compound or compounds like it in BindingDB:
Activity Spreadsheet -- Enzyme Inhibition Constant Data from BindingDB
Found 1 hit for monomerid = 213795
TargetDual specificity protein kinase TTK(Homo sapiens (Human))
Bayer Intellectual Property
US Patent
LigandPNGBDBM213795(US9284317, 1-7)
Affinity DataIC50:  4.10nMpH: 7.7 T: 2°C. Assay description: For the assay 50 nL of a 100-fold concentrated solution of the test compound in DMSO was pipetted into a black low volume 384 well microtiter plate (...
Ligand InfoPC cidPC sid
In DepthDetails US Patent