BDBM213809 US9284317, 2-1
SMILES CC(C)(C)OC(=O)NCCCNc1nc(cn2c(cnc12)-c1ccc(cc1)C(=O)NC1CC1)-c1ccncc1
InChI Key InChIKey=ZORPBBYSVUXAPM-UHFFFAOYSA-N
Data  1 IC50
  Tab Delimited (TSV)   2D SDfile   Computed 3D by Vconf -m prep SDfile
Find this compound or compounds like it in BindingDB:
Activity Spreadsheet -- Enzyme Inhibition Constant Data from BindingDB
Found 1 hit for monomerid = 213809
TargetDual specificity protein kinase TTK(Homo sapiens (Human))
Bayer Intellectual Property
US Patent
LigandPNGBDBM213809(US9284317, 2-1)
Affinity DataIC50:  8.30nMpH: 7.7 T: 2°C. Assay description: For the assay 50 nL of a 100-fold concentrated solution of the test compound in DMSO was pipetted into a black low volume 384 well microtiter plate (...
Ligand InfoPC cidPC sid
In DepthDetails US Patent