BDBM21409 4-(4-{[(4-{[(2R)-4-(dimethylamino)-1-(phenylsulfanyl)butan-2-yl]amino}-3-nitrobenzene)sulfonyl]carbamoyl}phenyl)-N-phenylpiperazine-1-carboxamide::Piperazine analogue, 22
SMILES CN(C)CC[C@H](CSc1ccccc1)Nc1ccc(cc1[N+]([O-])=O)S(=O)(=O)NC(=O)c1ccc(cc1)N1CCN(CC1)C(=O)Nc1ccccc1
InChI Key InChIKey=YXKBOKPOXNALDG-GDLZYMKVSA-N
Data  2 KI  2 EC50
  Tab Delimited (TSV)   2D SDfile   Computed 3D by Vconf -m prep SDfile
Find this compound or compounds like it in BindingDB:
Activity Spreadsheet -- Enzyme Inhibition Constant Data from BindingDB
Found 2 hits for monomerid = 21409
TargetBcl-2-like protein 1(Homo sapiens (Human))
Abbott Laboratories
LigandPNGBDBM21409(4-(4-{[(4-{[(2R)-4-(dimethylamino)-1-(phenylsulfan...)
Affinity DataKi:  2.5nM ΔG°:  -11.7kcal/mole EC50: >5.00E+4nMpH: 7.4 T: 2°C. Assay description: The binding affinities (Ki) of compounds were determined using fluorescence polarization assays (FPA) that measure their ability to competitively dis...
In DepthDetails ArticlePubMed
TargetApoptosis regulator Bcl-2(Homo sapiens (Human))
Abbott Laboratories
LigandPNGBDBM21409(4-(4-{[(4-{[(2R)-4-(dimethylamino)-1-(phenylsulfan...)
Affinity DataKi:  300nM EC50: >5.00E+4nM. Assay description: The binding affinities (Ki) of compounds were determined using fluorescence polarization assays (FPA) that measure their ability to competitively dis...
In DepthDetails ArticlePubMed