BDBM21461 3-[(1-amino-3-methylbutyl)(hydroxy)phosphoryl]-2-benzylpropanoic acid::CHEMBL36716::Phosphinic Peptide Inhibitor, 20
SMILES CC(C)CC(=N)P(O)(O)CC(Cc1ccccc1)C(O)=O
InChI Key InChIKey=PUCLBXYCGPUOHC-UHFFFAOYSA-N
Data  2 KI
  Tab Delimited (TSV)   2D SDfile   Computed 3D by Vconf -m prep SDfile
Find this compound or compounds like it in BindingDB:
Activity Spreadsheet -- Enzyme Inhibition Constant Data from BindingDB
Found 2 hits for monomerid = 21461
TargetAminopeptidase N(Sus scrofa (Pig))
University Of Paris
Curated by ChEMBL
LigandPNGBDBM21461(3-[(1-amino-3-methylbutyl)(hydroxy)phosphoryl]-2-b...)
Affinity DataKi:  370nM. Assay description: Inhibition of pig kidney Aminopeptidase N
In DepthDetails ArticlePubMed
TargetAngiotensin-converting enzyme 2(Homo sapiens (Human))
University Of Athens
LigandPNGBDBM21461(3-[(1-amino-3-methylbutyl)(hydroxy)phosphoryl]-2-b...)
Affinity DataKi: >1.00E+4nM ΔG°: >-6.82kcal/molepH: 6.8 T: 2°C. Assay description: Continuous assays were performed by recording the fluorescence increase at 405 nm (excitation@ 320 nm) induced by the cleavage of fluorogenic substra...
In DepthDetails ArticlePubMed