BDBM214761 Rhodanines, 49A
SMILES CC(N1C(=S)N\C(=C/c2ccc(o2)-c2cccc(Cl)c2)C1=O)C([O-])=O
InChI Key InChIKey=FQEIJPKNDSONMJ-JYRVWZFOSA-M
Data  1 IC50
  Tab Delimited (TSV)   2D SDfile   Computed 3D by Vconf -m prep SDfile
Find this compound or compounds like it in BindingDB:
Activity Spreadsheet -- Enzyme Inhibition Constant Data from BindingDB
Found 1 hit for monomerid = 214761
TargetIsoform Tau-F of Microtubule-associated protein tau(Homo sapiens (Human))
The Ohio State University
LigandPNGBDBM214761(Rhodanines, 49A)
Affinity DataIC50:  3.79E+3nMpH: 7.4Assay Description:The Tau content of fractions was determined by dot blot analysis using nitrocellulose membranes (0.2 μm porosity) as described previously [Cisek...
Ligand InfoPC cidPC sid
In DepthDetails ArticlePubMed