BDBM214763 Rhodanines, 51B
SMILES [O-]C(=O)CCCN1C(=S)S\C(=C/c2cccc(n2)-c2ccc(cc2)-c2ccccc2)C1=O
InChI Key InChIKey=CZZJHVGKJWPASG-JWGURIENSA-M
Data  1 IC50
  Tab Delimited (TSV)   2D SDfile   Computed 3D by Vconf -m prep SDfile
Find this compound or compounds like it in BindingDB:
Activity Spreadsheet -- Enzyme Inhibition Constant Data from BindingDB
Found 1 hit for monomerid = 214763
TargetIsoform Tau-F of Microtubule-associated protein tau(Homo sapiens (Human))
The Ohio State University
LigandPNGBDBM214763(Rhodanines, 51B)
Affinity DataIC50:  5.03E+3nMpH: 7.4Assay Description:The Tau content of fractions was determined by dot blot analysis using nitrocellulose membranes (0.2 μm porosity) as described previously [Cisek...
Ligand InfoPC cidPC sid
In DepthDetails ArticlePubMed