BDBM215053 US9296736, 4
SMILES CCOC(=O)[C@H](CC(C)C)N1C([C@H](C[C@H](CC(O)=O)C1=O)c1cccc(Cl)c1)c1ccc(Cl)cc1
InChI Key InChIKey=WIDCHSXWMFEAAW-FHJFUUOBSA-N
Data  1 IC50
  Tab Delimited (TSV)   2D SDfile   Computed 3D by Vconf -m prep SDfile
Find this compound or compounds like it in BindingDB:
Activity Spreadsheet -- Enzyme Inhibition Constant Data from BindingDB
Found 1 hit for monomerid = 215053
LigandPNGBDBM215053(US9296736, 4)
Affinity DataIC50:  190nMpH: 7.4 T: 2°C. Assay description: The standard assay conditions for the in vitro HTRF assay consisted of a 50 ul total reaction volume in black 384-well Costar polypropylene plates in...
Ligand InfoPC cidPC sid
In DepthDetails US Patent