BDBM215086 US9296736, 37::US9593129, Example 37
SMILES CCC(CC)CN1[C@@H]([C@H](C[C@H](CC(O)=O)C1=O)c1cccc(Cl)c1)c1ccc(Cl)cc1
InChI Key InChIKey=GVBZKJBISLMGIE-ZFJSRUIDSA-N
Data  2 IC50
  Tab Delimited (TSV)   2D SDfile   Computed 3D by Vconf -m prep SDfile
Find this compound or compounds like it in BindingDB:
Activity Spreadsheet -- Enzyme Inhibition Constant Data from BindingDB
Found 2 hits for monomerid = 215086
TargetE3 ubiquitin-protein ligase Mdm2 [1-188](Homo sapiens (Human))
Amgen
US Patent
LigandPNGBDBM215086(US9296736, 37 | US9593129, Example 37)
Affinity DataIC50:  60nM. Assay description: The standard assay conditions for the in vitro HTRF assay consisted of a 50 ul total reaction volume in black 384-well Costar polypropylene plates in...
Ligand InfoPC cidPC sid
In DepthDetails US Patent
LigandPNGBDBM215086(US9296736, 37 | US9593129, Example 37)
Affinity DataIC50:  60nMpH: 7.4 T: 2°C. Assay description: The standard assay conditions for the in vitro HTRF assay consisted of a 50 ul total reaction volume in black 384-well Costar polypropylene plates in...
Ligand InfoPC cidPC sid
In DepthDetails US Patent