BDBM21535 Galactose-Derived Compound 13::{[(2S,3R,4S,5R,6R)-5-hydroxy-6-(hydroxymethyl)-4-[(4-methylbenzene)amido]-2-(methylsulfanyl)oxan-3-yl]oxy}phosphinic acid
SMILES CS[C@@H]1O[C@H](CO)[C@H](O)[C@H](NC(=O)c2ccc(C)cc2)[C@H]1OP(O)=O
InChI Key InChIKey=GZFPNFSOEAXALX-KDBYPZKRSA-N
Data  1 Kd
  Tab Delimited (TSV)   2D SDfile   Computed 3D by Vconf -m prep SDfile
Find this compound or compounds like it in BindingDB:
Activity Spreadsheet -- Enzyme Inhibition Constant Data from BindingDB
Found 1 hit for monomerid = 21535
TargetGalectin-3(Homo sapiens (Human))
Lund University
LigandPNGBDBM21535(Galactose-Derived Compound 13 | {[(2S,3R,4S,5R,6R)...)
Affinity DataKd:  1.50E+5nMpH: 7.2 T: 2°C. Assay description: In fluorescence polarization measurements, a fluorescent probe was excited with plane-polarized light and the degree of polarization remaining in the...
In DepthDetails ArticlePubMed