BDBM215468 US9296745, 23
SMILES CC(C)c1cccc(-c2nc3ccc(nc3[nH]2)N2CCC[C@H](C2)C(=O)N2CCCC2)c1O
InChI Key
Data  1 IC50
  Tab Delimited (TSV)   2D SDfile   Computed 3D by Vconf -m prep SDfile
Find this compound or compounds like it in BindingDB:
Activity Spreadsheet -- Enzyme Inhibition Constant Data from BindingDB
Found 1 hit for monomerid = 215468
TargetDiacylglycerol O-acyltransferase 2(Homo sapiens (Human))
Pfizer
US Patent
LigandPNGBDBM215468(US9296745, 23)
Affinity DataIC50:  432nMpH: 7.4 T: 2°C. Assay description: For determination of IC50 values, the reactions were carried out in 384-well white Polyplates (Perkin Elmer) in a total volume of 20 uL. To 1 uL of c...
Ligand InfoPC cidPC sid
In DepthDetails US Patent