BDBM215478 US9296745, 33
SMILES Cc1cncc(c1)-c1nc2ccc(nc2[nH]1)N1CCC[C@H](C1)C(=O)N1CCCC1
InChI Key
Data  1 IC50
  Tab Delimited (TSV)   2D SDfile   Computed 3D by Vconf -m prep SDfile
Find this compound or compounds like it in BindingDB:
Activity Spreadsheet -- Enzyme Inhibition Constant Data from BindingDB
Found 1 hit for monomerid = 215478
TargetDiacylglycerol O-acyltransferase 2(Homo sapiens (Human))
Pfizer
US Patent
LigandPNGBDBM215478(US9296745, 33)
Affinity DataIC50:  97nMpH: 7.4 T: 2°C. Assay description: For determination of IC50 values, the reactions were carried out in 384-well white Polyplates (Perkin Elmer) in a total volume of 20 uL. To 1 uL of c...
Ligand InfoPC cidPC sid
In DepthDetails US Patent