BDBM216548 US9302989, 564
SMILES O=C(CC1CCCC1)Nc1ccc(NC(=O)N2Cc3ccc(cc3C2)C#N)cc1
InChI Key InChIKey=HPDHUCQTLSRJMK-UHFFFAOYSA-N
Data  2 IC50
  Tab Delimited (TSV)   2D SDfile   Computed 3D by Vconf -m prep SDfile
Find this compound or compounds like it in BindingDB:
Activity Spreadsheet -- Enzyme Inhibition Constant Data from BindingDB
Found 2 hits for monomerid = 216548
TargetNicotinamide phosphoribosyltransferase(Homo sapiens (Human))
Abbvie
US Patent
LigandPNGBDBM216548(US9302989, 564)
Affinity DataIC50:  1.59nMpH: 7.5Assay Description:Probe 2:The assay was carried out in 18 uL low volume plates (Owens Corning) in reaction buffer (50 mM HEPES (NaOH), pH 7.5, 100 mM NaCl, 10 mM MgCl2...
Ligand InfoPC cidPC sid
In DepthDetails US Patent
TargetNicotinamide phosphoribosyltransferase(Homo sapiens (Human))
Abbvie
US Patent
LigandPNGBDBM216548(US9302989, 564)
Affinity DataIC50:  1.96nMpH: 7.5Assay Description:Probe 1:The assay was carried out in 18 uL low volume plates (Owens Corning) in reaction buffer (50 mM HEPES (NaOH), pH 7.5, 100 mM NaCl, 10 mM MgCl2...
Ligand InfoPC cidPC sid
In DepthDetails US Patent