BDBM21676 (2S,4R)-4-[(1S,2S,5R,7S,9R,10R,11S,14R,15R)-5,9-dihydroxy-2,15-dimethyltetracyclo[8.7.0.0^{2,7}.0^{11,15}]heptadecan-14-yl]-2-methylpentanoic acid::23(S)-methyl-BA derivative, 7a
SMILES [H][C@@]1(CC[C@@]2([H])[C@]3([H])[C@H](O)C[C@]4([H])C[C@H](O)CC[C@]4(C)[C@@]3([H])CC[C@]12C)[C@H](C)C[C@H](C)C(O)=O
InChI Key InChIKey=XMIXAXLPZCFFCG-BQWNBIDXSA-N
Data  5 EC50
  Tab Delimited (TSV)   2D SDfile   Computed 3D by Vconf -m prep SDfile
Find this compound or compounds like it in BindingDB:
Activity Spreadsheet -- Enzyme Inhibition Constant Data from BindingDB
Found 5 hits for monomerid = 21676
TargetG-protein coupled bile acid receptor 1(Homo sapiens (Human))
University Di Perugia
LigandPNGBDBM21676((2S,4R)-4-[(1S,2S,5R,7S,9R,10R,11S,14R,15R)-5,9-di...)
Affinity DataEC50:  3.58E+3nMpH: 7.2 T: 2°C. Assay description: For transient transfection assays to analyze TGR5 activity, Chinese hamster ovary (CHO) cells were transfected with hTGR5 expression plasmid, cAMP-re...
In DepthDetails ArticlePubMed
TargetBile acid receptor(Homo sapiens (Human))
University Di Perugia
LigandPNGBDBM21676((2S,4R)-4-[(1S,2S,5R,7S,9R,10R,11S,14R,15R)-5,9-di...)
Affinity DataEC50: >1.00E+5nMpH: 7.2 T: 2°C. Assay description: To evaluate FXR activity of compounds, COS1 (ATCC) cells were transfected with hFXR expression plasmid, mouse retinoid X receptor expression plasmid,...
In DepthDetails ArticlePubMed
TargetBile acid receptor(Homo sapiens (Human))
University Di Perugia
LigandPNGBDBM21676((2S,4R)-4-[(1S,2S,5R,7S,9R,10R,11S,14R,15R)-5,9-di...)
Affinity DataEC50: >1.00E+5nM. Assay description: Agonist activity at FXR expressed in COS1 cells by cell-based bioluminescence assay
In DepthDetails ArticlePubMed
TargetG-protein coupled bile acid receptor 1(Homo sapiens (Human))
University Di Perugia
LigandPNGBDBM21676((2S,4R)-4-[(1S,2S,5R,7S,9R,10R,11S,14R,15R)-5,9-di...)
Affinity DataEC50:  3.58E+3nM. Assay description: Agonist activity at human TGR5 expressed in CHO cells assessed as increase in CRE-driven gene expression by luciferase reporter gene assay
In DepthDetails ArticlePubMed
TargetG-protein coupled bile acid receptor 1(Homo sapiens (Human))
University Di Perugia
LigandPNGBDBM21676((2S,4R)-4-[(1S,2S,5R,7S,9R,10R,11S,14R,15R)-5,9-di...)
Affinity DataEC50:  2.83E+3nM. Assay description: Agonist activity at human GPBAR1 expressed in HEK293 cells assessed as increase in intracellular cAMP level after 30 mins by cAMP-Glo assay
In DepthDetails ArticlePubMed