BDBM217327 US9302989, 552
SMILES O=C(NC1CCC(=CC1)c1n[nH]c(=O)c2ccccc12)N1Cc2ccc(CN3CCCC3)cc2C1
InChI Key
Data  1 KI
  Tab Delimited (TSV)   2D SDfile   Computed 3D by Vconf -m prep SDfile
Find this compound or compounds like it in BindingDB:
Activity Spreadsheet -- Enzyme Inhibition Constant Data from BindingDB
Found 1 hit for monomerid = 217327
TargetRho-associated protein kinase 2(Homo sapiens (Human))
Abbvie
US Patent
LigandPNGBDBM217327(US9302989, 552)
Affinity DataKi:  3.27E+3nM. Assay description: HTRF assay: This assay used the CisBio HTRF KinEASE kit (kit 62ST2PEZ) and the kinase reaction containing 0.2 uM biotinylated substrate peptide (S2, ...
Ligand InfoPC cidPC sid
In DepthDetails US Patent