BDBM217471 US9212182, 471::US9212182, 472
SMILES COc1cc(c(Cl)cc1-n1c2ccc(cc2ccc1=O)S(=O)(=O)Nc1ccon1)-c1ccc(Cl)c(C)c1
InChI Key InChIKey=MFXIFYWYWPVNBR-UHFFFAOYSA-N
Data  2 IC50
  Tab Delimited (TSV)   2D SDfile   Computed 3D by Vconf -m prep SDfile
Find this compound or compounds like it in BindingDB:
Activity Spreadsheet -- Enzyme Inhibition Constant Data from BindingDB
Found 2 hits for monomerid = 217471
TargetSodium channel protein type 9 subunit alpha(Homo sapiens (Human))
Amgen
US Patent
LigandPNGBDBM217471(US9212182, 471 | US9212182, 472)
Affinity DataIC50:  786nM. Assay description: HEK 293 cells stably transfected with human Nav1.7 were recorded in whole cell voltage clamp mode with the PatchXpress automated electrophysiology sy...
Ligand InfoPC cidPC sid
In DepthDetails US Patent
TargetSodium channel protein type 9 subunit alpha(Homo sapiens (Human))
Amgen
US Patent
LigandPNGBDBM217471(US9212182, 471 | US9212182, 472)
Affinity DataIC50:  8nM. Assay description: HEK 293 cells stably transfected with human Nav1.7 were recorded in whole cell voltage clamp mode with the PatchXpress automated electrophysiology sy...
Ligand InfoPC cidPC sid
In DepthDetails US Patent