BDBM21750 2-[(1R,4S,7S,13S,19S,22S,25S,28S,31S,34S,40S,43S,49S)-25-(4-aminobutyl)-49-benzyl-4,19-bis[(2S)-butan-2-yl]-34-(3-carbamimidamidopropyl)-28-[(1R)-1-hydroxyethyl]-22-(hydroxymethyl)-3,6,12,18,21,24,27,30,33,36,39,42,48,51-tetradecaoxo-53,54-dithia-2,5,11,17,20,23,26,29,32,35,38,41,47,50-tetradecaazapentacyclo[29.20.5.0^{7,11}.0^{13,17}.0^{43,47}]hexapentacontan-40-yl]acetic acid::Sunflower trypsin inhibitor-1(SFTI-1) analogue, 13
SMILES [#6]-[#6]-[#6@H](-[#6])-[#6@@H]-1-[#7]-[#6](=O)-[#6@@H]-2-[#6]-[#6]-[#6]-[#7]-2-[#6](=O)-[#6@@H]-2-[#6]-[#6]-[#6]-[#7]-2-[#6](=O)-[#6@@H](-[#7]-[#6](=O)-[#6@H](-[#6]-[#8])-[#7]-[#6](=O)-[#6@H](-[#6]-[#6]-[#6]-[#6]-[#7])-[#7]-[#6](=O)-[#6@@H](-[#7]-[#6](=O)-[#6@@H]-2-[#6]-[#6]-[#16]-[#16]-[#6]-[#6@H](-[#7]-[#6]-1=O)-[#6](=O)-[#7]-[#6@@H](-[#6]-c1ccccc1)-[#6](=O)-[#7]-1-[#6]-[#6]-[#6]-[#6@H]-1-[#6](=O)-[#7]-[#6@@H](-[#6]-[#6](-[#8])=O)-[#6](=O)-[#7]-[#6]-[#6](=O)-[#7]-[#6@@H](-[#6]-[#6]-[#6]\[#7]=[#6](\[#7])-[#7])-[#6](=O)-[#7]-2)-[#6@@H](-[#6])-[#8])-[#6@@H](-[#6])-[#6]-[#6]
InChI Key InChIKey=FXJGMDBUUGUSAE-HCYQVDMESA-N
Data  1 KI
  Tab Delimited (TSV)   2D SDfile   Computed 3D by Vconf -m prep SDfile
Find this compound or compounds like it in BindingDB:
Activity Spreadsheet -- Enzyme Inhibition Constant Data from BindingDB
Found 1 hit for monomerid = 21750
TargetSuppressor of tumorigenicity 14 protein(Homo sapiens (Human))
Georgetown University Medical Center
LigandPNGBDBM21750(2-[(1R,4S,7S,13S,19S,22S,25S,28S,31S,34S,40S,43S,4...)
Affinity DataKi:  380nM ΔG°:  -8.66kcal/molepH: 8.5 T: 2°C. Assay description: The enzyme reaction was initiated by adding fluorescence peptide substrate to reaction mixture containing enzyme and test compounds. The enzyme activ...
In DepthDetails ArticlePubMed