BDBM217776 US9212182, 1029
SMILES COc1cc(ccc1-n1c2ccc(cc2ccc1=O)S(=O)(=O)Nc1ccon1)-c1cc(Cl)ccc1C
InChI Key InChIKey=VJSMOAPANNRMGF-UHFFFAOYSA-N
Data  1 IC50
  Tab Delimited (TSV)   2D SDfile   Computed 3D by Vconf -m prep SDfile
Find this compound or compounds like it in BindingDB:
Activity Spreadsheet -- Enzyme Inhibition Constant Data from BindingDB
Found 1 hit for monomerid = 217776
TargetSodium channel protein type 9 subunit alpha(Homo sapiens (Human))
Amgen
US Patent
LigandPNGBDBM217776(US9212182, 1029)
Affinity DataIC50:  3nM. Assay description: HEK 293 cells stably transfected with human Nav1.7 were recorded in whole cell voltage clamp mode with the PatchXpress automated electrophysiology sy...
Ligand InfoPC cidPC sid
In DepthDetails US Patent