BDBM218723 US9296757, 45
SMILES O=C(C1CCc2c(C1)sc1ncnc(Nc3ccc4[nH]c(=O)sc4c3)c21)N1CCC1
InChI Key
Data  1 IC50
  Tab Delimited (TSV)   2D SDfile   Computed 3D by Vconf -m prep SDfile
Find this compound or compounds like it in BindingDB:
Activity Spreadsheet -- Enzyme Inhibition Constant Data from BindingDB
Found 1 hit for monomerid = 218723
LigandPNGBDBM218723(US9296757, 45)
Affinity DataIC50:  70nMpH: 7.5 T: 2°C. Assay description: For the assay 50 nL of a 100 fold concentrated solution of the test compound in DMSO was pipetted into a black low volume 384 well microtiter plate (...
Ligand InfoPC cidPC sid
In DepthDetails US Patent