BDBM218763 US9296757, 85
SMILES COc1cc2[nH]c(=O)sc2cc1Nc1ncnc2sc3CC(CCc3c12)C(=O)N(C)C
InChI Key
Data  1 IC50
  Tab Delimited (TSV)   2D SDfile   Computed 3D by Vconf -m prep SDfile
Find this compound or compounds like it in BindingDB:
Activity Spreadsheet -- Enzyme Inhibition Constant Data from BindingDB
Found 1 hit for monomerid = 218763
LigandPNGBDBM218763(US9296757, 85)
Affinity DataIC50:  4nMpH: 7.5 T: 2°C. Assay description: For the assay 50 nL of a 100 fold concentrated solution of the test compound in DMSO was pipetted into a black low volume 384 well microtiter plate (...
Ligand InfoPC cidPC sid
In DepthDetails US Patent