BDBM218772 US9302985, 1
SMILES CC(C)CN(c1ccccc1C(F)(F)F)S(=O)(=O)c1ccc(cc1)-c1ccc(cc1)S(C)(=O)=O
InChI Key InChIKey=MZPKLRPFDKVFGV-UHFFFAOYSA-N
Data  1 IC50
  Tab Delimited (TSV)   2D SDfile   Computed 3D by Vconf -m prep SDfile
Find this compound or compounds like it in BindingDB:
Activity Spreadsheet -- Enzyme Inhibition Constant Data from BindingDB
Found 1 hit for monomerid = 218772
TargetNuclear receptor ROR-gamma(Homo sapiens (Human))
Genentech
US Patent
LigandPNGBDBM218772(US9302985, 1)
Affinity DataIC50:  11.1nMpH: 7.4 T: 2°C. Assay description: On day of the assay, 100 μL of 0.05% CHAPS (in deionized H2O) was added to all wells of the GFB Unifilter plate and allowed soak for 1 h. A wash b...
Ligand InfoPC cidPC sid
In DepthDetails US Patent