BDBM21881 2,9-disubstituted 6-oxopurine, 12e::9-{4-[bis(prop-2-en-1-yl)amino]butyl}-2-(phenylamino)-6,9-dihydro-3H-purin-6-one dihydrochloride
SMILES C=CCN(CCCCn1cnc2c1nc(Nc1ccccc1)[nH]c2=O)CC=C
InChI Key InChIKey=VKFKZKOLOJWSKL-UHFFFAOYSA-N
Data  2 IC50
  Tab Delimited (TSV)   2D SDfile   Computed 3D by Vconf -m prep SDfile
Find this compound or compounds like it in BindingDB:
Activity Spreadsheet -- Enzyme Inhibition Constant Data from BindingDB
Found 2 hits for monomerid = 21881
TargetThymidine kinase(Human herpesvirus 2)
Glsynthesis
LigandPNGBDBM21881(2,9-disubstituted 6-oxopurine, 12e | 9-{4-[bis(pro...)
Affinity DataIC50:  420nM. Assay description: Recombinant HSV TKs were assayed in reaction mixture containing substrate [3H-methyl]TdR and test compounds. After reaction was stopped, the radioact...
In DepthDetails ArticlePubMed
TargetThymidine kinase(Human herpesvirus 1)
Glsynthesis
LigandPNGBDBM21881(2,9-disubstituted 6-oxopurine, 12e | 9-{4-[bis(pro...)
Affinity DataIC50:  2.10E+3nMpH: 7.5 T: 2°C. Assay description: Recombinant HSV TKs were assayed in reaction mixture containing substrate [3H-methyl]TdR and test compounds. After reaction was stopped, the radioact...
In DepthDetails ArticlePubMed