BDBM219137 US9303033, H12, Table 23A, Compound 94::US9303033, S13, Table 25A, Compound 1
SMILES O=C1NC(=O)\C(N1)=C\c1cnn2c(NC3CC3)cc(nc12)-c1ccc(CN2CCOCC2)s1
InChI Key InChIKey=OYOCDZLFPKERPX-MFOYZWKCSA-N
Data  4 IC50
  Tab Delimited (TSV)   2D SDfile   Computed 3D by Vconf -m prep SDfile
Find this compound or compounds like it in BindingDB:
Activity Spreadsheet -- Enzyme Inhibition Constant Data from BindingDB
Found 4 hits for monomerid = 219137
TargetCasein kinase II subunit alpha/beta(Homo sapiens (Human))
Senhwa Biosciences
US Patent
LigandPNGBDBM219137(US9303033, H12, Table 23A, Compound 94 | US9303033...)
Affinity DataIC50: <10nMpH: 7.2Assay Description:In a final reaction volume of 50 μl, CK2 ααββ (4 ng, 8.5 mU) was incubated with various concentrations of test compounds in ...
Ligand InfoPC cidPC sid
In DepthDetails US Patent
TargetCasein kinase II subunit alpha/beta(Homo sapiens (Human))
Senhwa Biosciences
US Patent
LigandPNGBDBM219137(US9303033, H12, Table 23A, Compound 94 | US9303033...)
Affinity DataIC50: <10nMpH: 7.2Assay Description:In a final reaction volume of 50 μl, CK2 ααββ (4 ng, 8.5 mU) was incubated with various concentrations of test compounds in ...
Ligand InfoPC cidPC sid
In DepthDetails US Patent
TargetCasein kinase II subunit beta(Homo sapiens (Human))
Senhwa Biosciences
US Patent
LigandPNGBDBM219137(US9303033, H12, Table 23A, Compound 94 | US9303033...)
Affinity DataIC50: >2.50E+3nMpH: 7.0Assay Description:5 uM ATP: Test compounds dissolved and diluted in DMSO (2 μl) were added to a reaction mixture comprising 10 μl of 5× Reaction Buffer (40 m...
Ligand InfoPC cidPC sid
In DepthDetails US Patent
TargetCasein kinase II subunit beta(Homo sapiens (Human))
Senhwa Biosciences
US Patent
LigandPNGBDBM219137(US9303033, H12, Table 23A, Compound 94 | US9303033...)
Affinity DataIC50: >2.50E+3nMpH: 7.0Assay Description:5 uM ATP: Test compounds dissolved and diluted in DMSO (2 μl) were added to a reaction mixture comprising 10 μl of 5× Reaction Buffer (40 m...
Ligand InfoPC cidPC sid
In DepthDetails US Patent