BDBM21950 2-{5-[(1S)-1-(2-amino-2-methylpropanamido)-2-(benzyloxy)ethyl]-1H-1,2,3,4-tetrazol-1-yl}ethyl N-[2-(3-hydroxyphenyl)ethyl]carbamate::Tetrazole-based compound, 16
SMILES CC(C)(N)C(=O)N[C@H](COCc1ccccc1)c1nnnn1CCOC(=O)NCCc1cccc(O)c1
InChI Key InChIKey=JMKGUEVCWGAJAZ-OAQYLSRUSA-N
Data  1 EC50
  Tab Delimited (TSV)   2D SDfile   Computed 3D by Vconf -m prep SDfile
Find this compound or compounds like it in BindingDB:
Activity Spreadsheet -- Enzyme Inhibition Constant Data from BindingDB
Found 1 hit for monomerid = 21950
TargetGrowth hormone secretagogue receptor type 1(Homo sapiens (Human))
Bristol-Myers Squibb Pharmaceutical Research Institute
LigandPNGBDBM21950(2-{5-[(1S)-1-(2-amino-2-methylpropanamido)-2-(benz...)
Affinity DataEC50:  7.90nMpH: 7.2 T: 2°C. Assay description: The functional FLIPR assay was developed from H4 glioma cells in which expression of the endogenous human GHS receptor was enhanced by RAGE-activatio...
In DepthDetails ArticlePubMed