BDBM219525 US9303033, R27, Table 37A, Compound 199
SMILES Cc1nn(C)c(C)c1CNc1nc(NC2CC2)n2ncc(\C=C3/NC(=O)NC3=O)c2n1
InChI Key InChIKey=YENMXFILGREAFI-NSIKDUERSA-N
Data  2 IC50
  Tab Delimited (TSV)   2D SDfile   Computed 3D by Vconf -m prep SDfile
Find this compound or compounds like it in BindingDB:
Activity Spreadsheet -- Enzyme Inhibition Constant Data from BindingDB
Found 2 hits for monomerid = 219525
TargetCasein kinase II subunit beta(Homo sapiens (Human))
Senhwa Biosciences
US Patent
LigandPNGBDBM219525(US9303033, R27, Table 37A, Compound 199)
Affinity DataIC50: >1.00E+3nMpH: 7.0Assay Description:Test compounds dissolved and diluted in DMSO (2 μl) were added to a reaction mixture comprising 10 μl of 5× Reaction Buffer (40 mM MOPS pH ...
Ligand InfoPC cidPC sid
In DepthDetails US Patent
TargetCasein kinase II subunit alpha/beta(Homo sapiens (Human))
Senhwa Biosciences
US Patent
LigandPNGBDBM219525(US9303033, R27, Table 37A, Compound 199)
Affinity DataIC50: <10nMpH: 7.2Assay Description:In a final reaction volume of 50 μl, CK2 ααββ (4 ng, 8.5 mU) was incubated with various concentrations of test compounds in ...
Ligand InfoPC cidPC sid
In DepthDetails US Patent