BDBM219946 US9303033, W43, Table 50A, Compound 28
SMILES O=C1NC(=O)\C(N1)=C\c1cnn2c(NC3CC3)cc(NCc3ccccc3-n3cncn3)nc12
InChI Key InChIKey=ZHNOWNWUKFHDKM-APSNUPSMSA-N
Data  1 IC50
  Tab Delimited (TSV)   2D SDfile   Computed 3D by Vconf -m prep SDfile
Find this compound or compounds like it in BindingDB:
Activity Spreadsheet -- Enzyme Inhibition Constant Data from BindingDB
Found 1 hit for monomerid = 219946
TargetCasein kinase II subunit alpha/beta(Homo sapiens (Human))
Senhwa Biosciences
US Patent
LigandPNGBDBM219946(US9303033, W43, Table 50A, Compound 28)
Affinity DataIC50: <10nMpH: 7.2Assay Description:In a final reaction volume of 50 μl, CK2 ααββ (4 ng, 8.5 mU) was incubated with various concentrations of test compounds in ...
Ligand InfoPC cidPC sid
In DepthDetails US Patent