BDBM219952 US9303033, C44, Table 50A, Compound 34
SMILES O[C@H]1CC[C@@H](CC1)Nc1cc(NC2CC2)n2ncc(\C=C3/NC(=O)NC3=O)c2n1
InChI Key InChIKey=OOORGFJFVDGCHS-CWXOVMGASA-N
Data  1 IC50
  Tab Delimited (TSV)   2D SDfile   Computed 3D by Vconf -m prep SDfile
Find this compound or compounds like it in BindingDB:
Activity Spreadsheet -- Enzyme Inhibition Constant Data from BindingDB
Found 1 hit for monomerid = 219952
TargetCasein kinase II subunit alpha/beta(Homo sapiens (Human))
Senhwa Biosciences
US Patent
LigandPNGBDBM219952(US9303033, C44, Table 50A, Compound 34)
Affinity DataIC50: <10nMpH: 7.2Assay Description:In a final reaction volume of 50 μl, CK2 ααββ (4 ng, 8.5 mU) was incubated with various concentrations of test compounds in ...
Ligand InfoPC cidPC sid
In DepthDetails US Patent