BDBM220226 US9290476, 69
SMILES COc1nc2ccc(cc2c(C#N)c1Cc1ccc(cc1)-n1cccn1)C(O)(c1cncn1C)c1ccc(Cl)cc1
InChI Key InChIKey=VEARGWNSFNEBEE-UHFFFAOYSA-N
Data  1 Kd
  Tab Delimited (TSV)   2D SDfile   Computed 3D by Vconf -m prep SDfile
Find this compound or compounds like it in BindingDB:
Activity Spreadsheet -- Enzyme Inhibition Constant Data from BindingDB
Found 1 hit for monomerid = 220226
TargetIsoform 2 of Nuclear receptor ROR-gamma (RORgT)(Homo sapiens (Human))
Janssen Pharmaceutica
US Patent
LigandPNGBDBM220226(US9290476, 69)
Affinity DataKd:  50nMpH: 7.0 T: 2°C. Assay description: Bar-coded assay plates are robotically loaded onto a thermostatically controlled PCR-type thermal block and then heated at a typical ramp-rate of 1 &...
Ligand InfoPC cidPC sid
In DepthDetails US Patent