BDBM220460 US9296741, 49
SMILES Cn1cc(-c2cc(NS(C)(=O)=O)ccc2Oc2c(F)cc(F)cc2F)c2cc[nH]c2c1=O
InChI Key InChIKey=CNZVJFFZAXTOLD-UHFFFAOYSA-N
Data  2 KI
  Tab Delimited (TSV)   2D SDfile   Computed 3D by Vconf -m prep SDfile
Find this compound or compounds like it in BindingDB:
Activity Spreadsheet -- Enzyme Inhibition Constant Data from BindingDB
Found 2 hits for monomerid = 220460
TargetBromodomain-containing protein 4 [352-457](Homo sapiens (Human))
Abbvie
US Patent
LigandPNGBDBM220460(US9296741, 49)
Affinity DataKi:  1.5nM ΔG°:  -12.0kcal/molepH: 6.0 T: 2°C. Assay description: A time-resolved fluorescence resonance energy transfer (TR-FRET) assay was used to determine the affinities of compounds of the Examples listed in Ta...
Ligand InfoPC cidPC sid
In DepthDetails US Patent
TargetBromodomain-containing protein 4 [57-168](Homo sapiens (Human))
Abbvie
US Patent
LigandPNGBDBM220460(US9296741, 49)
Affinity DataKi:  1.70nM ΔG°:  -12.0kcal/molepH: 6.0 T: 2°C. Assay description: A time-resolved fluorescence resonance energy transfer (TR-FRET) assay was used to determine the affinities of compounds of the Examples listed in Ta...
Ligand InfoPC cidPC sid
In DepthDetails US Patent