BDBM220828 US9296759, 94
SMILES NC1=NC2(CCO1)c1cc(NC(=O)c3ccc(Cl)cn3)ccc1Oc1cnc(cc21)-c1ccnc(F)c1
InChI Key InChIKey=YNZQZTWZKPFTLB-UHFFFAOYSA-N
Data  2 IC50
  Tab Delimited (TSV)   2D SDfile   Computed 3D by Vconf -m prep SDfile
Find this compound or compounds like it in BindingDB:
Activity Spreadsheet -- Enzyme Inhibition Constant Data from BindingDB
Found 2 hits for monomerid = 220828
TargetCathepsin D(Homo sapiens (Human))
Amgen
US Patent
LigandPNGBDBM220828(US9296759, 94)
Affinity DataIC50:  4.00E+5nMpH: 3.5Assay Description:Recombinant CathepsinD was expressed in CHO cells. The assay buffer for CathepsinD is 0.05 M citrate pH 3.5, 10% DMSO final, 5 mM CHAPS. The Cathepsi...
Ligand InfoPC cidPC sid
In DepthDetails US Patent
TargetBeta-secretase 1(Homo sapiens (Human))
Amgen
US Patent
LigandPNGBDBM220828(US9296759, 94)
Affinity DataIC50:  1.60nMpH: 4.2Assay Description:The assay buffer used in this screen is 0.05 M acetate, pH 4.2, 10% DMSO final, 100 uM genapol (which is a nonionic detergent, below its Critical Mic...
Ligand InfoPC cidPC sid
In DepthDetails US Patent