BDBM220833 US9296759, 98
SMILES COc1ccc(nc1)C(=O)Nc1ccc2Oc3c(F)nc(cc3C3(CCOC(N)=N3)c2c1)-c1ccnc(F)c1
InChI Key InChIKey=AYBGYGZHVQEVID-UHFFFAOYSA-N
Data  2 IC50
  Tab Delimited (TSV)   2D SDfile   Computed 3D by Vconf -m prep SDfile
Find this compound or compounds like it in BindingDB:
Activity Spreadsheet -- Enzyme Inhibition Constant Data from BindingDB
Found 2 hits for monomerid = 220833
TargetCathepsin D(Homo sapiens (Human))
Amgen
US Patent
LigandPNGBDBM220833(US9296759, 98)
Affinity DataIC50:  4.00E+5nMpH: 3.5Assay Description:Recombinant CathepsinD was expressed in CHO cells. The assay buffer for CathepsinD is 0.05 M citrate pH 3.5, 10% DMSO final, 5 mM CHAPS. The Cathepsi...
Ligand InfoPC cidPC sid
In DepthDetails US Patent
TargetBeta-secretase 1(Homo sapiens (Human))
Amgen
US Patent
LigandPNGBDBM220833(US9296759, 98)
Affinity DataIC50:  1.10nMpH: 4.2Assay Description:The assay buffer used in this screen is 0.05 M acetate, pH 4.2, 10% DMSO final, 100 uM genapol (which is a nonionic detergent, below its Critical Mic...
Ligand InfoPC cidPC sid
In DepthDetails US Patent