BDBM221050 N-acetyl ciprofloxacin
SMILES CC(=O)N1CCN(CC1)c1cc2n(cc(C(O)=O)c(=O)c2cc1F)C1CC1
InChI Key InChIKey=VIISGXFPKLOPRI-UHFFFAOYSA-N
Data  1 IC50
  Tab Delimited (TSV)   2D SDfile   Computed 3D by Vconf -m prep SDfile
Find this compound or compounds like it in BindingDB:
Activity Spreadsheet -- Enzyme Inhibition Constant Data from BindingDB
Found 1 hit for monomerid = 221050
TargetUrease subunit alpha(Helicobacter pylori)
Minia University
LigandPNGBDBM221050(N-acetyl ciprofloxacin)
Affinity DataIC50:  2.26E+3nM. Assay description: The assay mixture, containing 50 μl (2 mg/ml) of enzyme and 100 μl of different concentration of the tested agents, was added to 850 μ...
In DepthDetails ArticlePubMed