BDBM221245 US9303015, 19
SMILES Cn1cncc1C(O)(c1ccc(Cl)cc1)c1ccc2nc(C#N)c(Oc3ccccc3)c(Cl)c2c1
InChI Key InChIKey=JYJUFLUFYWUNRJ-UHFFFAOYSA-N
Data  1 IC50  1 Kd
  Tab Delimited (TSV)   2D SDfile   Computed 3D by Vconf -m prep SDfile
Find this compound or compounds like it in BindingDB:
Activity Spreadsheet -- Enzyme Inhibition Constant Data from BindingDB
Found 2 hits for monomerid = 221245
TargetNuclear receptor ROR-gamma [258-518,Y502F](Homo sapiens (Human))
Janssen Pharmaceutica
US Patent
LigandPNGBDBM221245(US9303015, 19)
Affinity DataIC50:  410nM. Assay description: The reporter assay was performed by transiently transfecting HEK293T cells with 5 μg of pBIND-RORγt LBD or pBIND-RORγt LBD-AF2 and 5 &...
Ligand InfoPC cidPC sid
In DepthDetails US Patent
TargetNuclear receptor ROR-gamma [258-518](Homo sapiens (Human))
Janssen Pharmaceutica
US Patent
LigandPNGBDBM221245(US9303015, 19)
Affinity DataKd:  32nMpH: 7.0 T: 2°C. Assay description: ThermoFluor® experiments were carried out using instruments owned by Janssen Research and Discovery, L.L.C. through its acquisition of 3-Dimensio...
Ligand InfoPC cidPC sid
In DepthDetails US Patent