BDBM22141 aza-peptide Michael acceptor, 5u::benzyl N-[(1S)-1-{[(1S)-1-[N'-(carbamoylmethyl)-N'-[(2E)-4-(2,3-dihydro-1H-indol-1-yl)-4-oxobut-2-enoyl]hydrazinecarbonyl]ethyl]carbamoyl}ethyl]carbamate
SMILES C[C@H](NC(=O)OCc1ccccc1)C(=O)N[C@@H](C)C(=O)NN(CC(N)=O)C(=O)C=CC(=O)N1CCc2ccccc12
InChI Key InChIKey=VJBCWRFEYWGQMX-OALUTQOASA-N
Data  3 IC50
  Tab Delimited (TSV)   2D SDfile   Computed 3D by Vconf -m prep SDfile
Find this compound or compounds like it in BindingDB:
Activity Spreadsheet -- Enzyme Inhibition Constant Data from BindingDB
Found 3 hits for monomerid = 22141
TargetLegumain(Schistosoma mansoni)
Georgia Institute Of Technology
LigandPNGBDBM22141(aza-peptide Michael acceptor, 5u | benzyl N-[(1S)-...)
Affinity DataIC50:  70nMT: 2°C. Assay description: AE activity in the induction medium was measured with the substrate Cbz-Ala-Ala-Asn-AMC. In a black 96-well microtiter plate, aza-peptidyl inhibitors...
In DepthDetails ArticlePubMed
TargetLegumain(Ixodes ricinus)
Georgia Institute Of Technology
LigandPNGBDBM22141(aza-peptide Michael acceptor, 5u | benzyl N-[(1S)-...)
Affinity DataIC50:  18nMT: 2°C. Assay description: AE activity in the induction medium was measured with the substrate Cbz-Ala-Ala-Asn-AMC. In a black 96-well microtiter plate, aza-peptidyl inhibitors...
In DepthDetails ArticlePubMed
TargetClan CD, family C13, asparaginyl endopeptidase-like cysteine peptidase(Trichomonas vaginalis G3)
Georgia Institute Of Technology
LigandPNGBDBM22141(aza-peptide Michael acceptor, 5u | benzyl N-[(1S)-...)
Affinity DataIC50:  50nMT: 2°C. Assay description: AE activity in the induction medium was measured with the substrate Cbz-Ala-Ala-Asn-AMC. In a black 96-well microtiter plate, aza-peptidyl inhibitors...
In DepthDetails ArticlePubMed