BDBM221668 US9303045, 180::US9695195, 180
SMILES O=C(OC1CC2COCC(C1)N2)c1cn(-c2ccc(cc2)C#N)c2ccccc12
InChI Key InChIKey=QAXBYMRZORRAHL-UHFFFAOYSA-N
Data  2 IC50
  Tab Delimited (TSV)   2D SDfile   Computed 3D by Vconf -m prep SDfile
Find this compound or compounds like it in BindingDB:
Activity Spreadsheet -- Enzyme Inhibition Constant Data from BindingDB
Found 2 hits for monomerid = 221668
Target5-hydroxytryptamine receptor 3A(Homo sapiens (Human))
Takeda Pharmaceutical
US Patent
LigandPNGBDBM221668(US9303045, 180 | US9695195, 180)
Affinity DataIC50:  5.91nMT: 2°C. Assay description: The 5HT3 antagonist activity of the compounds of the invention was determined by measuring the ability of the compounds to inhibit the calcium flux a...
Ligand InfoPC cidPC sid
In DepthDetails US Patent
Target5-hydroxytryptamine receptor 3A(Homo sapiens (Human))
Takeda Pharmaceutical
US Patent
LigandPNGBDBM221668(US9303045, 180 | US9695195, 180)
Affinity DataIC50:  5.91nMT: 2°C. Assay description: The 5HT3 antagonist activity of the compounds of the invention was determined by measuring the ability of the compounds to inhibit the calcium flux a...
Ligand InfoPC cidPC sid
In DepthDetails US Patent