BDBM221699 US10568884, Cpd 20::US9314464, 20::US9593100, Compound 20::USRE49556, Compound 20
SMILES COC(=O)N[C@H](C)CNc1nccc(n1)-c1cn(nc1-c1cc(Cl)cc(NS(C)(=O)=O)c1F)C(C)C
InChI Key InChIKey=CMJCXYNUCSMDBY-CYBMUJFWSA-N
Data  5 IC50
  Tab Delimited (TSV)   2D SDfile   Computed 3D by Vconf -m prep SDfile
Find this compound or compounds like it in BindingDB:
Activity Spreadsheet -- Enzyme Inhibition Constant Data from BindingDB
Found 5 hits for monomerid = 221699
TargetSerine/threonine-protein kinase B-raf(Homo sapiens (Human))
Novartis
US Patent
LigandPNGBDBM221699(US10568884, Cpd 20 | US9314464, 20 | US9593100, Co...)
Affinity DataIC50:  0.800nMpH: 7.5 T: 2°C. Assay description: B-Raf (V600E; 4 μM) and biotinylated Mek (kinase dead; 10 nM) were combined at 2× final concentrations in assay buffer (50 mM Tris, pH 7.5, ...
In DepthDetails US Patent
TargetSerine/threonine-protein kinase B-raf(Homo sapiens (Human))
Novartis
US Patent
LigandPNGBDBM221699(US10568884, Cpd 20 | US9314464, 20 | US9593100, Co...)
Affinity DataIC50:  0.800nM. Assay description: B-Raf (V600E; 4 pM) and biotinylated Mek (kinase dead; 10 nM) were combined at 2× final concentrations in assay buffer (50 mM Tris, pH 7.5, 15 mM MgC...
In DepthDetails US Patent
TargetSerine/threonine-protein kinase B-raf [V600E](Homo sapiens (Human))
Array Biopharma
US Patent
LigandPNGBDBM221699(US10568884, Cpd 20 | US9314464, 20 | US9593100, Co...)
Affinity DataIC50:  0.800nM. Assay description: B-Raf (V600E; 4 pM) and biotinylated Mek (kinase dead; 10 nM) were combined at 2× final concentrations in assay buffer (50 mM Tris, pH 7.5, 15 mM MgC...
In DepthDetails US Patent
TargetSerine/threonine-protein kinase B-raf [V600E](Homo sapiens (Human))
Array Biopharma
US Patent
LigandPNGBDBM221699(US10568884, Cpd 20 | US9314464, 20 | US9593100, Co...)
Affinity DataIC50:  0.800nM. Assay description: The B-Raf kinase activity reaction was started by the addition of 10 μl piper well of 2×ATP (10 μM) diluted in assay buffer. After 3 hours,...
In DepthDetails US Patent
TargetSerine/threonine-protein kinase B-raf(Homo sapiens (Human))
Novartis
US Patent
LigandPNGBDBM221699(US10568884, Cpd 20 | US9314464, 20 | US9593100, Co...)
Affinity DataIC50:  0.800nM. Assay description: B-Raf (V600E; 4 pM) and biotinylated Mek (kinase dead; 10 nM) were combined at 2× final concentrations in assay buffer (50 mM Tris, pH 7.5, 15 mM MgC...
In DepthDetails US Patent