BDBM221714 US9314468, Table 7, Compound 1
SMILES NCCCCN(Cc1nccc2c1[nH]c1ccccc21)C1CCCc2cccnc12
InChI Key
Data  1 IC50
  Tab Delimited (TSV)   2D SDfile   Computed 3D by Vconf -m prep SDfile
Find this compound or compounds like it in BindingDB:
Activity Spreadsheet -- Enzyme Inhibition Constant Data from BindingDB
Found 1 hit for monomerid = 221714
TargetC-X-C chemokine receptor type 4(Homo sapiens (Human))
Altiris Therapeutics
US Patent
LigandPNGBDBM221714(US9314468, Table 7, Compound 1)
Affinity DataIC50:  142nMT: 2°C. Assay description: Functional modulation of CXCR4 was determined by calcium mobilization assay using leukemic lymphoid CEM cells, which naturally express high levels of...
Ligand InfoPC cidPC sid
In DepthDetails US Patent