BDBM221807 US9314468, Table 7, Compound 94
SMILES C(N(Cc1nccc2c3ccccc3[nH]c12)[C@H]1CCCc2cccnc12)c1ccccc1N1CCNCC1
InChI Key
Data  1 IC50
  Tab Delimited (TSV)   2D SDfile   Computed 3D by Vconf -m prep SDfile
Find this compound or compounds like it in BindingDB:
Activity Spreadsheet -- Enzyme Inhibition Constant Data from BindingDB
Found 1 hit for monomerid = 221807
TargetC-X-C chemokine receptor type 4(Homo sapiens (Human))
Altiris Therapeutics
US Patent
LigandPNGBDBM221807(US9314468, Table 7, Compound 94)
Affinity DataIC50:  3.73E+3nMT: 2°C. Assay description: Functional modulation of CXCR4 was determined by calcium mobilization assay using leukemic lymphoid CEM cells, which naturally express high levels of...
Ligand InfoPC cidPC sid
In DepthDetails US Patent